{"text_format":"1","workbook":"xlsx","n_sheets":5,"sheets":["dok.jawna","dok.niejawna","Ewid1","Ewid2","Jednostki"],"not_rendered":{"charts":0,"images":0,"macros":1,"external_links":0,"defined_names":13,"comments":5,"pivot_tables":0},"unopened":[],"bounds":{"document_bytes":16777216,"sheet_cells":100000,"rows_first":2000,"rows_last":500,"rows_between":2000,"halvings":0,"cell_chars":16384,"cell_head_chars":4096},"cells_cut":0,"cells_raw":0,"read":"whole","date_system":"1900"}

{"sheet":"dok.jawna","index":0,"n_rows":770,"n_cols":15,"rows_kept":770,"cut":false,"hidden":false,"merged":[[220,0,220,2],[221,0,221,2],[222,0,222,2],[204,0,204,2],[205,0,205,2],[206,0,206,2],[223,0,223,2],[224,0,224,2],[209,0,209,2],[210,0,210,2],[211,0,211,2],[212,0,212,2],[213,0,213,2],[214,0,214,2],[215,0,215,2],[216,0,216,2],[217,0,217,2],[218,0,218,2],[219,0,219,2],[188,0,188,2],[189,0,189,2],[190,0,190,2],[207,0,207,2],[208,0,208,2],[193,0,193,2],[194,0,194,2],[195,0,195,2],[196,0,196,2],[197,0,197,2],[198,0,198,2],[199,0,199,2],[200,0,200,2],[201,0,201,2],[202,0,202,2],[203,0,203,2],[171,0,171,2],[172,0,172,2],[173,0,173,2],[191,0,191,2],[192,0,192,2],[176,0,176,2],[177,0,177,2],[178,0,178,2],[179,0,179,2],[180,0,180,2],[181,0,181,2],[182,0,182,2],[183,0,183,2],[184,0,184,2],[186,0,186,2],[187,0,187,2],[136,5,136,9],[140,0,140,3],[143,0,143,3],[174,0,174,2],[175,0,175,2],[146,0,146,1],[146,2,146,3],[162,0,162,2],[163,0,163,2],[164,0,164,2],[165,0,165,2],[166,0,166,2],[167,0,167,2],[168,0,168,2],[169,0,169,2],[170,0,170,2],[130,5,130,9],[131,1,131,3],[131,5,131,9],[135,1,135,3],[135,5,135,9],[145,0,145,1],[145,2,145,3],[22,1,23,1],[22,2,24,2],[22,4,24,4],[130,1,130,3],[136,1,136,3],[14,0,14,9],[17,4,17,5],[21,0,24,0],[21,1,21,2],[21,3,24,3],[21,4,21,5],[21,6,24,6],[21,7,24,7],[21,8,24,8],[21,9,24,9],[22,5,24,5],[9,0,9,9],[11,3,11,5],[11,6,11,7],[0,0,0,3],[1,0,1,3],[1,4,1,9],[2,0,2,3],[4,0,4,1],[4,2,4,3]]}
["Komenda Wojewódzka Policji w Łodzi",null,null,null,null,null,null,{"$f":"IF(Ewid1!G5=\"KWP1241\",J164,IF(Ewid1!G5=\"KWP1212\",J164,J163))","v":"Łódź"},", dnia"]
["Wydział ds. Ochrony Informacji Niejawnych ",null,null,null," "]
["(Nazwa komórki organizacyjnej, która wytworzyła akta)"]
[null,null,null,null,null,null,null,null,"Egz. nr "]
["L. dz. \nwytwórcy akt"]
[]
[]
[]
[]
["S P I S"]
[]
[null,null,null,"                    akt przekazanych Nr"]
[null,null,null,null,null,null,"(nadaje archiwum)"]
[]
["do ARCHIWUM KWP  w Łodzi"]
[]
[null,null,null,null,null,null,null,null,null,null,null,2007]
[null,null,null,"dnia",null,null,null,null,null,null,null,2020]
[null,null,null,null,"    (wpisuje archiwum)"]
[]
{"$rows_left_out":751}
{"sheet":"dok.niejawna","index":1,"n_rows":769,"n_cols":15,"rows_kept":769,"cut":false,"hidden":false,"merged":[[162,9,162,10],[161,9,161,10],[163,9,163,10],[145,0,145,4],[147,0,147,1],[147,2,147,3],[148,0,148,1],[148,2,148,3],[138,6,138,10],[23,8,26,8],[23,9,26,9],[138,1,138,3],[23,6,26,6],[23,7,26,7],[23,10,26,10],[24,1,25,1],[137,1,137,3],[128,0,128,7],[132,1,132,3],[132,6,132,10],[133,1,133,3],[133,6,133,10],[137,6,137,10],[24,2,26,2],[24,4,26,4],[24,5,26,5],[16,0,16,10],[4,8,4,9],[5,0,5,1],[5,2,5,3],[5,7,5,10],[6,2,6,3],[11,0,11,10],[19,4,19,5],[23,0,26,0],[23,1,23,2],[23,3,26,3],[23,4,23,5],[0,8,0,10],[1,0,1,3],[1,6,1,8],[13,3,13,5],[13,6,13,7],[6,0,6,1],[2,0,2,3],[3,0,3,3],[0,4,0,5]]}
[null,null,null,null,"Poufne"]
["Komenda Wojewódzka Policji w Łodzi",null,null,null,null,null,{"$f":"IF(Ewid2!G5=\"KWP1241\",J164,IF(Ewid2!G5=\"KWP1212\",J164,J163))","v":"Łódź"},null,null,", dnia "]
["Wydział ds. Ochrony Informacji Niejawnych "]
["(Nazwa komórki organizacyjnej, która wytworzyła akta)"]
[]
["L. dz. \nwytwórcy akt"]
["L. dz. \nkancelarii tajnej"]
[]
[]
[]
[]
["S P I S"]
[]
[null,null,null,"                    akt przekazanych Nr"]
[null,null,null,null,null,null,"(nadaje archiwum)"]
[]
["do ARCHIWUM KWP  w Łodzi"]
[]
[]
[null,null,null,"dnia"]
{"$rows_left_out":750}
{"sheet":"Ewid1","index":2,"n_rows":108,"n_cols":16,"rows_kept":108,"cut":false,"hidden":true,"merged":[[5,6,5,8],[6,0,6,4],[6,6,6,10]]}
[null,null,null,null,"Arkusz wypełniany automatycznie poza polami oznaczonymi kolorem zielonym i żółtym (zawierającymi komentarze)"]
[]
["Po zakończeniu edycji spisu zaznacz cały wiersz 5, skopiuj i wklej zawartość do bazy danych.",null,null,null,null,null,null,{"$f":"IF(D6=\"KOMENDA WOJ\",E6,F6)","v":"KWP1208"},{"$f":"LEFT(H3,3)","v":"KWP"},{"$f":"MID(H3,2,7)","v":"WP1208"}]
["IDSpisu","NrSpisu","OznLit","Archiwum","DataSpisu","L.dz.arch.KWP","Jednostka","L.dz","Klauzula","Miejscowość","Data edycji","Rok1","Rok2","IlośćPozycji","IlośćTeczek","Uwagi"]
[null,{"$f":"dok.jawna!G12","v":0},{"$f":"dok.jawna!I12","v":0},17,{"$f":"dok.jawna!E18","v":"00:00:00"},"OIN-Dp-",{"$f":"IF(D6=\"KOMENDA WOJ\",E6,F6)","v":"KWP1208"},{"$f":"TRIM(dok.jawna!C5)","v":""},1,{"$f":"dok.jawna!H1","v":"Łódź"},{"$f":"dok.jawna!J1","v":"00:00:00"},{"$f":"MINA(Rok_1)*1","v":{"$error":"#VALUE!"}},{"$f":"MAXA(Rok_2)*1","v":{"$error":"#VALUE!"}},{"$f":"DCOUNT(dok.jawna!A22:D125,1,A22:A125)","v":100},{"$f":"SUM(dok.jawna!G26:G125)","v":0}]
[null,null,null,{"$f":"LEFT(G6,11)","v":"Komenda Woj"},{"$f":"VLOOKUP(dok.jawna!A2,Jednostki!B83:C152,2,FALSE)","v":"KWP1208"},{"$f":"VLOOKUP(dok.jawna!A1,Siedziba,3)","v":"KWP1200"},{"$f":"dok.jawna!A1","v":"Komenda Wojewódzka Policji w Łodzi"}]
["Zaznacz wszystkie wypełnione wiersze (jednostki archiwalne), skopiu je i wklej do bazy danych.  ",null,null,null,null,null,{"$f":"TRIM(L7)","v":"Wydział ds. Ochrony Informacji Niejawnych"},null,null,null,null,{"$f":"VLOOKUP(H3,Jednostki!A4:B73,2)","v":"Wydział ds. Ochrony Informacji Niejawnych "}]
["IDSpisu","Jednostka","NrSpisu","PozSpisu","Symbol","NrTeczki","TytułTeczki","Data1","Data2","IlośćTeczek","KatArch","Klauzula","POP","Uwagi"]
[{"$f":"A5","v":0},{"$f":"G5","v":"KWP1208"},{"$f":"B5","v":0},{"$f":"dok.jawna!A26","v":1},{"$f":"IF(dok.jawna!$B$25=2020,dok.jawna!B26&\" \"&\"Q\",dok.jawna!B26&\" \"&\"N\")","v":" Q"},{"$f":"dok.jawna!C26","v":0},{"$f":"TRIM(dok.jawna!D26)","v":""},{"$f":"dok.jawna!E26","v":0},{"$f":"dok.jawna!F26","v":0},{"$f":"dok.jawna!G26","v":0},{"$f":"dok.jawna!H26","v":0},{"$f":"I5","v":1},"0",{"$f":"dok.jawna!J26","v":0}]
[{"$f":"A9","v":0},{"$f":"B9","v":"KWP1208"},{"$f":"C9","v":0},{"$f":"dok.jawna!A27","v":2},{"$f":"IF(dok.jawna!$B$25=2020,dok.jawna!B27&\" \"&\"Q\",dok.jawna!B27&\" \"&\"N\")","v":" Q"},{"$f":"dok.jawna!C27","v":0},{"$f":"TRIM(dok.jawna!D27)","v":""},{"$f":"dok.jawna!E27","v":0},{"$f":"dok.jawna!F27","v":0},{"$f":"dok.jawna!G27","v":0},{"$f":"dok.jawna!H27","v":0},{"$f":"L9","v":1},"0",{"$f":"dok.jawna!J27","v":0}]
[{"$f":"A10","v":0},{"$f":"B10","v":"KWP1208"},{"$f":"C10","v":0},{"$f":"dok.jawna!A28","v":3},{"$f":"IF(dok.jawna!$B$25=2020,dok.jawna!B28&\" \"&\"Q\",dok.jawna!B28&\" \"&\"N\")","v":" Q"},{"$f":"dok.jawna!C28","v":0},{"$f":"TRIM(dok.jawna!D28)","v":""},{"$f":"dok.jawna!E28","v":0},{"$f":"dok.jawna!F28","v":0},{"$f":"dok.jawna!G28","v":0},{"$f":"dok.jawna!H28","v":0},{"$f":"L10","v":1},"0",{"$f":"dok.jawna!J28","v":0}]
[0,"KWP1208",0,{"$f":"dok.jawna!A29","v":4},{"$f":"IF(dok.jawna!$B$25=2020,dok.jawna!B29&\" \"&\"Q\",dok.jawna!B29&\" \"&\"N\")","v":" Q"},{"$f":"dok.jawna!C29","v":0},{"$f":"TRIM(dok.jawna!D29)","v":""},{"$f":"dok.jawna!E29","v":0},{"$f":"dok.jawna!F29","v":0},{"$f":"dok.jawna!G29","v":0},{"$f":"dok.jawna!H29","v":0},1,"0",{"$f":"dok.jawna!J29","v":0}]
[0,"KWP1208",0,{"$f":"dok.jawna!A30","v":5},{"$f":"IF(dok.jawna!$B$25=2020,dok.jawna!B30&\" \"&\"Q\",dok.jawna!B30&\" \"&\"N\")","v":" Q"},{"$f":"dok.jawna!C30","v":0},{"$f":"TRIM(dok.jawna!D30)","v":""},{"$f":"dok.jawna!E30","v":0},{"$f":"dok.jawna!F30","v":0},{"$f":"dok.jawna!G30","v":0},{"$f":"dok.jawna!H30","v":0},1,"0",{"$f":"dok.jawna!J30","v":0}]
[0,"KWP1208",0,{"$f":"dok.jawna!A31","v":6},{"$f":"IF(dok.jawna!$B$25=2020,dok.jawna!B31&\" \"&\"Q\",dok.jawna!B31&\" \"&\"N\")","v":" Q"},{"$f":"dok.jawna!C31","v":0},{"$f":"TRIM(dok.jawna!D31)","v":""},{"$f":"dok.jawna!E31","v":0},{"$f":"dok.jawna!F31","v":0},{"$f":"dok.jawna!G31","v":0},{"$f":"dok.jawna!H31","v":0},1,"0",{"$f":"dok.jawna!J31","v":0}]
[0,"KWP1208",0,{"$f":"dok.jawna!A32","v":7},{"$f":"IF(dok.jawna!$B$25=2020,dok.jawna!B32&\" \"&\"Q\",dok.jawna!B32&\" \"&\"N\")","v":" Q"},{"$f":"dok.jawna!C32","v":0},{"$f":"TRIM(dok.jawna!D32)","v":""},{"$f":"dok.jawna!E32","v":0},{"$f":"dok.jawna!F32","v":0},{"$f":"dok.jawna!G32","v":0},{"$f":"dok.jawna!H32","v":0},1,"0",{"$f":"dok.jawna!J32","v":0}]
[0,"KWP1208",0,{"$f":"dok.jawna!A33","v":8},{"$f":"IF(dok.jawna!$B$25=2020,dok.jawna!B33&\" \"&\"Q\",dok.jawna!B33&\" \"&\"N\")","v":" Q"},{"$f":"dok.jawna!C33","v":0},{"$f":"TRIM(dok.jawna!D33)","v":""},{"$f":"dok.jawna!E33","v":0},{"$f":"dok.jawna!F33","v":0},{"$f":"dok.jawna!G33","v":0},{"$f":"dok.jawna!H33","v":0},1,"0",{"$f":"dok.jawna!J33","v":0}]
[0,"KWP1208",0,{"$f":"dok.jawna!A34","v":9},{"$f":"IF(dok.jawna!$B$25=2020,dok.jawna!B34&\" \"&\"Q\",dok.jawna!B34&\" \"&\"N\")","v":" Q"},{"$f":"dok.jawna!C34","v":0},{"$f":"TRIM(dok.jawna!D34)","v":""},{"$f":"dok.jawna!E34","v":0},{"$f":"dok.jawna!F34","v":0},{"$f":"dok.jawna!G34","v":0},{"$f":"dok.jawna!H34","v":0},1,"0",{"$f":"dok.jawna!J34","v":0}]
[0,"KWP1208",0,{"$f":"dok.jawna!A35","v":10},{"$f":"IF(dok.jawna!$B$25=2020,dok.jawna!B35&\" \"&\"Q\",dok.jawna!B35&\" \"&\"N\")","v":" Q"},{"$f":"dok.jawna!C35","v":0},{"$f":"TRIM(dok.jawna!D35)","v":""},{"$f":"dok.jawna!E35","v":0},{"$f":"dok.jawna!F35","v":0},{"$f":"dok.jawna!G35","v":0},{"$f":"dok.jawna!H35","v":0},1,"0",{"$f":"dok.jawna!J35","v":0}]
[0,"KWP1208",0,{"$f":"dok.jawna!A36","v":11},{"$f":"IF(dok.jawna!$B$25=2020,dok.jawna!B36&\" \"&\"Q\",dok.jawna!B36&\" \"&\"N\")","v":" Q"},{"$f":"dok.jawna!C36","v":0},{"$f":"TRIM(dok.jawna!D36)","v":""},{"$f":"dok.jawna!E36","v":0},{"$f":"dok.jawna!F36","v":0},{"$f":"dok.jawna!G36","v":0},{"$f":"dok.jawna!H36","v":0},1,"0",{"$f":"dok.jawna!J36","v":0}]
[0,"KWP1208",0,{"$f":"dok.jawna!A37","v":12},{"$f":"IF(dok.jawna!$B$25=2020,dok.jawna!B37&\" \"&\"Q\",dok.jawna!B37&\" \"&\"N\")","v":" Q"},{"$f":"dok.jawna!C37","v":0},{"$f":"TRIM(dok.jawna!D37)","v":""},{"$f":"dok.jawna!E37","v":0},{"$f":"dok.jawna!F37","v":0},{"$f":"dok.jawna!G37","v":0},{"$f":"dok.jawna!H37","v":0},1,"0",{"$f":"dok.jawna!J37","v":0}]
{"$rows_left_out":89}
{"sheet":"Ewid2","index":3,"n_rows":115,"n_cols":18,"rows_kept":115,"cut":false,"hidden":true,"merged":[[5,6,5,8],[6,0,6,5],[6,6,6,8]]}
[null,null,null,null,"Arkusz wypełniany automatycznie poza polami oznaczonymi kolorem zielonym  (zawierającymi komentarze)"]
[]
["Po zakończeniu edycji spisu zaznacz cały wiersz 5, skopiuj i wklej zawartość do bazy danych.",null,null,null,null,null,null,{"$f":"IF(D6=\"KOMENDA WOJ\",E6,F6)","v":"KWP1208"},{"$f":"LEFT(H3,3)","v":"KWP"},{"$f":"MID(H3,2,7)","v":"WP1208"}]
["IDSpisu","NrSpisu","OznLit","Archiwum","DataSpisu","L.dz.arch.KWP","Jednostka","L.dz","Klauzula","Miejscowość","Data edycji","Rok1","Rok2","IlośćPozycji","IlośćTeczek","Uwagi","L.dz. kancelarii tajnej"]
[null,{"$f":"dok.niejawna!G14","v":0},{"$f":"dok.niejawna!I14","v":0},17,{"$f":"dok.niejawna!E20","v":"00:00:00"},"OIN-a-",{"$f":"IF(D6=\"KOMENDA WOJ\",E6,F6)","v":"KWP1208"},{"$f":"TRIM(dok.niejawna!C6)","v":""},{"$f":"VLOOKUP(R6,IDCechyTaj,2)","v":2},{"$f":"dok.niejawna!G2","v":"Łódź"},{"$f":"dok.niejawna!K2","v":"00:00:00"},{"$f":"MINA(RokI)*1","v":{"$error":"#VALUE!"}},{"$f":"MAXA(RokII)*1","v":{"$error":"#VALUE!"}},{"$f":"DCOUNT(dok.niejawna!A24:D127,1,A23:A126)","v":100},{"$f":"SUM(dok.niejawna!G28:G127)","v":0},null,{"$f":"TRIM(dok.niejawna!C7)","v":""}]
[null,null,null,{"$f":"LEFT(G6,11)","v":"Komenda Woj"},{"$f":"VLOOKUP(dok.niejawna!A3,Jednostki!B83:C154,2,FALSE)","v":"KWP1208"},{"$f":"VLOOKUP(dok.niejawna!A2,Siedziba,3)","v":"KWP1200"},{"$f":"dok.niejawna!A2","v":"Komenda Wojewódzka Policji w Łodzi"},{"$f":"VLOOKUP(dok.niejawna!B3,Siedziba,1,3)","v":{"$error":"#N/A"}},{"$f":"VLOOKUP(dok.niejawna!C3,Siedziba,1,3)","v":{"$error":"#N/A"}},null,null,null,null,null,null,null,null,{"$f":"dok.niejawna!E1","v":"Poufne"}]
["Zaznacz wszystkie wypełnione wiersze (jednostki archiwalne), skopiu je i wklej do bazy danych.  ",null,null,null,null,null,{"$f":"TRIM(J7)","v":"Wydział ds. Ochrony Informacji Niejawnych"},null,null,{"$f":"VLOOKUP(H3,Jednostki!A4:B73,2)","v":"Wydział ds. Ochrony Informacji Niejawnych "}]
["IDSpisu","Jednostka","NrSpisu","PozSpisu","Symbol","NrTeczki","TytułTeczki","Data1","Data2","IlośćTeczek","KatArch","Klauzula","POP","Uwagi"]
[{"$f":"A5","v":0},{"$f":"G5","v":"KWP1208"},{"$f":"B5","v":0},{"$f":"dok.niejawna!A28","v":1},{"$f":"IF(dok.niejawna!$B$27=2020,dok.niejawna!B28&\" \"&\"Q\",dok.niejawna!B28&\" \"&\"N\")","v":" Q"},{"$f":"dok.niejawna!C28","v":0},{"$f":"TRIM(dok.niejawna!D28)","v":""},{"$f":"dok.niejawna!E28","v":0},{"$f":"dok.niejawna!F28","v":0},{"$f":"dok.niejawna!G28","v":0},{"$f":"dok.niejawna!H28","v":0},{"$f":"VLOOKUP(R9,IDCechyTaj,2)","v":1},"0",{"$f":"dok.niejawna!K28","v":0},null,null,null,{"$f":"dok.niejawna!I28","v":" "}]
[{"$f":"A9","v":0},{"$f":"B9","v":"KWP1208"},{"$f":"C9","v":0},{"$f":"dok.niejawna!A29","v":2},{"$f":"IF(dok.niejawna!$B$27=2020,dok.niejawna!B29&\" \"&\"Q\",dok.niejawna!B29&\" \"&\"N\")","v":" Q"},{"$f":"dok.niejawna!C29","v":0},{"$f":"TRIM(dok.niejawna!D29)","v":""},{"$f":"dok.niejawna!E29","v":0},{"$f":"dok.niejawna!F29","v":0},{"$f":"dok.niejawna!G29","v":0},{"$f":"dok.niejawna!H29","v":0},1,"0",{"$f":"dok.niejawna!K29","v":0},null,null,null,{"$f":"dok.niejawna!I29","v":" "}]
[{"$f":"A10","v":0},"KWP1208",0,{"$f":"dok.niejawna!A30","v":3},{"$f":"IF(dok.niejawna!$B$27=2020,dok.niejawna!B30&\" \"&\"Q\",dok.niejawna!B30&\" \"&\"N\")","v":" Q"},{"$f":"dok.niejawna!C30","v":0},{"$f":"TRIM(dok.niejawna!D30)","v":""},{"$f":"dok.niejawna!E30","v":0},{"$f":"dok.niejawna!F30","v":0},{"$f":"dok.niejawna!G30","v":0},{"$f":"dok.niejawna!H30","v":0},1,"0",{"$f":"dok.niejawna!K30","v":0},null,null,null,{"$f":"dok.niejawna!I30","v":" "}]
[0,"KWP1208",0,{"$f":"dok.niejawna!A31","v":4},{"$f":"IF(dok.niejawna!$B$27=2020,dok.niejawna!B31&\" \"&\"Q\",dok.niejawna!B31&\" \"&\"N\")","v":" Q"},{"$f":"dok.niejawna!C31","v":0},{"$f":"TRIM(dok.niejawna!D31)","v":""},{"$f":"dok.niejawna!E31","v":0},{"$f":"dok.niejawna!F31","v":0},{"$f":"dok.niejawna!G31","v":0},{"$f":"dok.niejawna!H31","v":0},1,"0",{"$f":"dok.niejawna!K31","v":0},null,null,null,{"$f":"dok.niejawna!I31","v":" "}]
[0,"KWP1208",0,{"$f":"dok.niejawna!A32","v":5},{"$f":"IF(dok.niejawna!$B$27=2020,dok.niejawna!B32&\" \"&\"Q\",dok.niejawna!B32&\" \"&\"N\")","v":" Q"},{"$f":"dok.niejawna!C32","v":0},{"$f":"TRIM(dok.niejawna!D32)","v":""},{"$f":"dok.niejawna!E32","v":0},{"$f":"dok.niejawna!F32","v":0},{"$f":"dok.niejawna!G32","v":0},{"$f":"dok.niejawna!H32","v":0},1,"0",{"$f":"dok.niejawna!K32","v":0},null,null,null,{"$f":"dok.niejawna!I32","v":" "}]
[0,"KWP1208",0,{"$f":"dok.niejawna!A33","v":6},{"$f":"IF(dok.niejawna!$B$27=2020,dok.niejawna!B33&\" \"&\"Q\",dok.niejawna!B33&\" \"&\"N\")","v":" Q"},{"$f":"dok.niejawna!C33","v":0},{"$f":"TRIM(dok.niejawna!D33)","v":""},{"$f":"dok.niejawna!E33","v":0},{"$f":"dok.niejawna!F33","v":0},{"$f":"dok.niejawna!G33","v":0},{"$f":"dok.niejawna!H33","v":0},1,"0",{"$f":"dok.niejawna!K33","v":0},null,null,null,{"$f":"dok.niejawna!I33","v":" "}]
[0,"KWP1208",0,{"$f":"dok.niejawna!A34","v":7},{"$f":"IF(dok.niejawna!$B$27=2020,dok.niejawna!B34&\" \"&\"Q\",dok.niejawna!B34&\" \"&\"N\")","v":" Q"},{"$f":"dok.niejawna!C34","v":0},{"$f":"TRIM(dok.niejawna!D34)","v":""},{"$f":"dok.niejawna!E34","v":0},{"$f":"dok.niejawna!F34","v":0},{"$f":"dok.niejawna!G34","v":0},{"$f":"dok.niejawna!H34","v":0},1,"0",{"$f":"dok.niejawna!K34","v":0},null,null,null,{"$f":"dok.niejawna!I34","v":" "}]
[0,"KWP1208",0,{"$f":"dok.niejawna!A35","v":8},{"$f":"IF(dok.niejawna!$B$27=2020,dok.niejawna!B35&\" \"&\"Q\",dok.niejawna!B35&\" \"&\"N\")","v":" Q"},{"$f":"dok.niejawna!C35","v":0},{"$f":"TRIM(dok.niejawna!D35)","v":""},{"$f":"dok.niejawna!E35","v":0},{"$f":"dok.niejawna!F35","v":0},{"$f":"dok.niejawna!G35","v":0},{"$f":"dok.niejawna!H35","v":0},1,"0",{"$f":"dok.niejawna!K35","v":0},null,null,null,{"$f":"dok.niejawna!I35","v":" "}]
[0,"KWP1208",0,{"$f":"dok.niejawna!A36","v":9},{"$f":"IF(dok.niejawna!$B$27=2020,dok.niejawna!B36&\" \"&\"Q\",dok.niejawna!B36&\" \"&\"N\")","v":" Q"},{"$f":"dok.niejawna!C36","v":0},{"$f":"TRIM(dok.niejawna!D36)","v":""},{"$f":"dok.niejawna!E36","v":0},{"$f":"dok.niejawna!F36","v":0},{"$f":"dok.niejawna!G36","v":0},{"$f":"dok.niejawna!H36","v":0},1,"0",{"$f":"dok.niejawna!K36","v":0},null,null,null,{"$f":"dok.niejawna!I36","v":" "}]
[0,"KWP1208",0,{"$f":"dok.niejawna!A37","v":10},{"$f":"IF(dok.niejawna!$B$27=2020,dok.niejawna!B37&\" \"&\"Q\",dok.niejawna!B37&\" \"&\"N\")","v":" Q"},{"$f":"dok.niejawna!C37","v":0},{"$f":"TRIM(dok.niejawna!D37)","v":""},{"$f":"dok.niejawna!E37","v":0},{"$f":"dok.niejawna!F37","v":0},{"$f":"dok.niejawna!G37","v":0},{"$f":"dok.niejawna!H37","v":0},1,"0",{"$f":"dok.niejawna!K37","v":0},null,null,null,{"$f":"dok.niejawna!I37","v":" "}]
[0,"KWP1208",0,{"$f":"dok.niejawna!A38","v":11},{"$f":"IF(dok.niejawna!$B$27=2020,dok.niejawna!B38&\" \"&\"Q\",dok.niejawna!B38&\" \"&\"N\")","v":" Q"},{"$f":"dok.niejawna!C38","v":0},{"$f":"TRIM(dok.niejawna!D38)","v":""},{"$f":"dok.niejawna!E38","v":0},{"$f":"dok.niejawna!F38","v":0},{"$f":"dok.niejawna!G38","v":0},{"$f":"dok.niejawna!H38","v":0},1,"0",{"$f":"dok.niejawna!K38","v":0},null,null,null,{"$f":"dok.niejawna!I38","v":" "}]
[0,"KWP1208",0,{"$f":"dok.niejawna!A39","v":12},{"$f":"IF(dok.niejawna!$B$27=2020,dok.niejawna!B39&\" \"&\"Q\",dok.niejawna!B39&\" \"&\"N\")","v":" Q"},{"$f":"dok.niejawna!C39","v":0},{"$f":"TRIM(dok.niejawna!D39)","v":""},{"$f":"dok.niejawna!E39","v":0},{"$f":"dok.niejawna!F39","v":0},{"$f":"dok.niejawna!G39","v":0},{"$f":"dok.niejawna!H39","v":0},1,"0",{"$f":"dok.niejawna!K39","v":0},null,null,null,{"$f":"dok.niejawna!I39","v":" "}]
{"$rows_left_out":96}
{"sheet":"Jednostki","index":4,"n_rows":1389,"n_cols":8,"rows_kept":1389,"cut":false,"hidden":true,"merged":[]}
[null,null,null,"Siedziba",null,null,null,"000"]
[null,"Aktualne jednostki i komórki KWP Łódź",null,null,null,null,null,"0000"]
["IDJedn","NazwaJedn","Miejscowość","NazwaJedn","Siedziba","IdJedn",null,"0001"]
["CBŚ1161","Centralne Biuro Śledcze Policji","Łódź","Centralne Biuro Śledcze Policji","Łódź","CBŚ1161",null,"001"]
["KMP1241","Komenda Miejska Policji w Łodzi","Łódź","I Komisariat Komendy Miejskiej Policji w Łodzi","Łódź","KOP1244",null,"0010"]
["KMP1255","Komenda Miejska Policji w Piotrkowie Trybunalskim","Piotrków Trybunalski","I Zastępca Komendanta Wojewódzkiego Policji w Łodzi ","Łódź","KWP1202",null,"0011"]
["KMP1256","Komenda Miejska Policji w Skierniewicach","Skierniewice","II Komisariat Komendy Miejskiej Policji w Łodzi","Łódź","KOP1245",null,"0012"]
["KOP1244","I Komisariat Komendy Miejskiej Policji w Łodzi","Łódź","III Komisariat Komendy Miejskiej Policji w Łodzi","Łódź","KOP1246",null,"0013"]
["KOP1245","II Komisariat Komendy Miejskiej Policji w Łodzi","Łódź","IV Komisariat Komendy Miejskiej Policji w Łodzi","Łódź","KOP1247",null,"0014"]
["KOP1246","III Komisariat Komendy Miejskiej Policji w Łodzi","Łódź","Komenda Miejska Policji w Łodzi","Łódź","KMP1241",null,"0015"]
["KOP1247","IV Komisariat Komendy Miejskiej Policji w Łodzi","Łódź","Komenda Miejska Policji w Piotrkowie Trybunalskim","Piotrków Trybunalski","KMP1255",null,"002"]
["KOP1248","V Komisariat Komendy Miejskiej Policji w Łodzi","Łódź","Komenda Miejska Policji w Skierniewicach","Skierniewice","KMP1256",null,"003"]
["KOP1249","VI Komisariat Komendy Miejskiej Policji w Łodzi","Łódź","Komenda Powiatowa Policji Łódź-Wschód","Koluszki","KPP1218",null,"004"]
["KOP1250","VII Komisariat Komendy Miejskiej Policji w Łodzi","Łódź","Komenda Powiatowa Policji w Bełchatowie","Bełchatów","KPP1201",null,"005"]
["KOP1251","VIII Komisariat Komendy Miejskiej Policji w Łodzi","Łódź","Komenda Powiatowa Policji w Brzezinach","Brzeziny","KPP1219",null,"006"]
["KPP1201","Komenda Powiatowa Policji w Bełchatowie","Bełchatów","Komenda Powiatowa Policji w Kutnie","Kutno","KPP1202",null,"007"]
["KPP1202","Komenda Powiatowa Policji w Kutnie","Kutno","Komenda Powiatowa Policji w Łasku","Łask","KPP1203",null,"008"]
["KPP1203","Komenda Powiatowa Policji w Łasku","Łask","Komenda Powiatowa Policji w Łęczycy","Łęczyca","KPP1204",null,"010"]
["KPP1204","Komenda Powiatowa Policji w Łęczycy","Łęczyca","Komenda Powiatowa Policji w Łowiczu","Łowicz","KPP1205",null,"011"]
["KPP1205","Komenda Powiatowa Policji w Łowiczu","Łowicz","Komenda Powiatowa Policji w Opocznie","Opoczno","KPP1206",null,"0110"]
{"$rows_left_out":1369}